{"text_format":"1","workbook":"xlsx","n_sheets":16,"sheets":["Instructions","Tools","Summary","Open Pit","UG Mine","Tailings","Rock Pile","Chemicals","Bldgs & Equip","Water Management","Water Treatment","PostClosure","ICM","Mobilization","Unit_Costs","Estimator"],"not_rendered":{"charts":0,"images":3,"macros":1,"external_links":0,"defined_names":126,"comments":0,"pivot_tables":0},"unopened":[],"bounds":{"document_bytes":16777216,"sheet_cells":100000,"rows_first":2000,"rows_last":500,"rows_between":2000,"halvings":0,"cell_chars":16384,"cell_head_chars":4096},"cells_cut":0,"cells_raw":0,"read":"whole","date_system":"1900"}

{"sheet":"Instructions","index":0,"n_rows":70,"n_cols":8,"rows_kept":70,"cut":false,"hidden":false,"merged":[[59,0,68,1],[33,0,33,1],[34,0,39,1],[40,0,47,1],[48,0,54,1],[55,0,58,1]]}
["Project Name:",null,"Reclaim Model - Overview of Program"]
[null,"Blank                    ","All users are urged to read the Reclaim Model User Manual - Scroll down for overview description of program.",null,null,"","",""]
[null,null,"Important!  Reclaim 7.0 works better with no other excel files open."]
[null,null,"If other excel files are open ignore run time error and proceed"]
["Reclaim Menu",null,"The default Excel menu bar has an additional tab labelled \"Add-Ins\" that provides options specific to the Reclaim Model.",null,null,"","",""]
[null,"Clear","This option deletes all input data, deletes any duplicated elements and blanks out the project name.  It also allows for segregation into land costs vs water costs if required.",null,null,"","",""]
[null,"Duplicate","This option Duplicates components of the project. E.g. if there is more than one Open Pit, use duplicate to add a second Open Pit.  Quantities for the new Open Pit are erased, but the Activities and Cost Codes are carried over from the original Open Pit.  The new Open Pit subtotal is added to the Summary page.",null,null,"","",""]
[null,"Unit Costs","This option opens a window of unit costs to provide easy reference.  NOTE:  the unit cost table has a filter in the 'UNITS' column.   You can select to only see a particular unit (eg km) or multiple units (km and m3) or all units.",null,null,"","",""]
[null,"Print All ","This option prints the Summary Worksheet, Unit Cost Worksheet, and the individual component worksheets having non-zero balances.  Individual worksheets can be printed directly using standard printing methods, such as Ctl - P.",null,null,"","",""]
[null,"Quit","Select Quit to exit the program",null,null,"","",""]
{"$rows_left_out":61}
{"sheet":"Tools","index":1,"n_rows":12,"n_cols":12,"rows_kept":12,"cut":false,"hidden":false,"merged":[]}
["The functions in this worksheet serve as a back up in the event that the menu item \"Add-Ins\" is not shown in Excel menu bar"]
[]
[]
[null,null,"Save file before clearing all data"]
[]
[null,null,null,null,null,null,null,null,null,null,null,"These functions duplicate components within worksheet"]
[]
[]
[null,null,"Shows both active worksheet as well as table of Unit Costs in a separate window"]
[]
{"$rows_left_out":3}
{"sheet":"Summary","index":2,"n_rows":26,"n_cols":8,"rows_kept":26,"cut":false,"hidden":false,"merged":[]}
[null,"SUMMARY OF COSTS"]
[]
["CAPITAL COSTS","COMPONENT NAME",null,"COST",null,"LAND LIABILITY",null,"WATER LIABILITY"]
["OPEN PIT",{"$f":"IF(ISBLANK('Open Pit'!$C$1),\"\",'Open Pit'!$C$1)","v":""},null,{"$f":"Pit1Total","v":1E-4},null,{"$f":"Pit1LandTotal","v":0},null,{"$f":"Pit1WaterTotal","v":0}]
["UNDERGROUND MINE",{"$f":"IF(ISBLANK('UG Mine'!$C$1),\"\",'UG Mine'!$C$1)","v":""},null,{"$f":"UG1Total","v":1E-4},null,{"$f":"UG1LandTotal","v":0},null,{"$f":"UG1WaterTotal","v":0}]
["TAILINGS FACILITY",{"$f":"IF(ISBLANK(Tailings!$C$1),\"\",Tailings!$C$1)","v":""},null,{"$f":"Tailings1Total","v":1E-4},null,{"$f":"Tailings1LandTotal","v":0},null,{"$f":"Tailings1WaterTotal","v":0}]
["ROCK PILE",{"$f":"IF(ISBLANK('Rock Pile'!$C$1),\"\",'Rock Pile'!$C$1)","v":""},null,{"$f":"RP1Total","v":1E-4},null,{"$f":"RP1LandTotal","v":0},null,{"$f":"RP1WaterTotal","v":0}]
["BUILDINGS AND EQUIPMENT",{"$f":"IF(ISBLANK('Bldgs & Equip'!$C$1),\"\",'Bldgs & Equip'!$C$1)","v":""},null,{"$f":"Bldg1Total","v":1E-4},null,{"$f":"Bldg1LandTotal","v":0},null,{"$f":"Bldg1WaterTotal","v":0}]
["CHEMICALS AND CONTAMINATED SOIL MANAGEMENT",{"$f":"IF(ISBLANK(Chemicals!$C$1),\"\",Chemicals!$C$1)","v":""},null,{"$f":"Chem1Total","v":1E-4},null,{"$f":"Chem1LandTotal","v":0},null,{"$f":"Chem1WaterTotal","v":0}]
["SURFACE AND GROUNDWATER MANAGEMENT",{"$f":"IF(ISBLANK('Water Treatment'!$C$1),\"\",'Water Treatment'!$C$1)","v":""},null,{"$f":"Water1Total","v":1E-4},null,"-",null,{"$f":"Water1Total","v":1E-4}]
{"$rows_left_out":17}
{"sheet":"Open Pit","index":3,"n_rows":64,"n_cols":11,"rows_kept":64,"cut":false,"hidden":false,"merged":[]}
[1,"Open Pit Name: ",null,null,null,null,"Pit #",1]
[]
[null,"ACTIVITY/MATERIAL","Notes","Units","Quantity","Cost Code","Unit Cost","Cost","% Land","Land Cost","Water Cost"]
[null,"CONTROL ACCESS"]
[null,"Fence",null,"m",null,{"$f":"NA()","v":{"$error":"#N/A"}},{"$f":"IF(ISNA(F5),0,INDEX(IF(UPPER(RIGHT(F5,1))=Low,UnitCostLow, IF(UPPER(RIGHT(F5,1))=High,UnitCostHigh,UnitCostSpecified)),MATCH(UPPER(LEFT(F5,LEN(F5)-1)),CostCode,0)))","v":0},{"$f":"G5*E5","v":0},null,{"$f":"H5*I5","v":0},{"$f":"H5*(1-I5)","v":0}]
[null,"Signs",null,"each",null,{"$f":"NA()","v":{"$error":"#N/A"}},0,{"$f":"G6*E6","v":0},null,{"$f":"H6*I6","v":0},{"$f":"H6*(1-I6)","v":0}]
[null,"Berm at crest",null,"m3",null,{"$f":"NA()","v":{"$error":"#N/A"}},0,{"$f":"G7*E7","v":0},null,0,0]
[null,"Block roads",null,"m3",null,{"$f":"NA()","v":{"$error":"#N/A"}},0,{"$f":"G8*E8","v":0},null,0,0]
[null,"Other",null,null,null,{"$f":"NA()","v":{"$error":"#N/A"}},{"$f":"IF(ISNA(F9),0,INDEX(IF(UPPER(RIGHT(F9,1))=Low,UnitCostLow, IF(UPPER(RIGHT(F9,1))=High,UnitCostHigh,UnitCostSpecified)),MATCH(UPPER(LEFT(F9,LEN(F9)-1)),CostCode,0)))","v":0},{"$f":"G9*E9","v":0},null,{"$f":"H9*I9","v":0},{"$f":"H9*(1-I9)","v":0}]
[null,"STABILITY STUDY"]
{"$rows_left_out":55}
{"sheet":"UG Mine","index":4,"n_rows":43,"n_cols":11,"rows_kept":43,"cut":false,"hidden":false,"merged":[]}
[1,"Underground Mine Name",null,null,null,null,"UG Mine #",1]
[]
[null,"ACTIVITY/MATERIAL","Notes","Unit","Qty","Cost Code","Unit Cost","Cost","% Land","Land Cost","Water Cost"]
[null,"CONTROL ACCESS"]
[null,"Fence",null,"m",null,{"$error":"#N/A"},{"$f":"IF(ISNA(F5),0,INDEX(IF(UPPER(RIGHT(F5,1))=Low,UnitCostLow, IF(UPPER(RIGHT(F5,1))=High,UnitCostHigh,UnitCostSpecified)),MATCH(UPPER(LEFT(F5,LEN(F5)-1)),CostCode,0)))","v":0},{"$f":"G5*E5","v":0},null,{"$f":"H5*I5","v":0},{"$f":"H5*(1-I5)","v":0}]
[null,"Signs",null,"each",null,{"$f":"NA()","v":{"$error":"#N/A"}},0,0,null,{"$f":"H6*I6","v":0},{"$f":"H6*(1-I6)","v":0}]
[null,"Block roads",null,"m3",null,{"$f":"NA()","v":{"$error":"#N/A"}},0,{"$f":"G7*E7","v":0},null,0,0]
[null,"Berm",null,"m3",null,{"$f":"NA()","v":{"$error":"#N/A"}},0,0,null,0,0]
[null,"Concrete wall in  portals",null,"m3",null,{"$f":"NA()","v":{"$error":"#N/A"}},0,0,null,{"$f":"H9*I9","v":0},{"$f":"H9*(1-I9)","v":0}]
[null,"Backfill portal #1",null,"m3",null,{"$f":"NA()","v":{"$error":"#N/A"}},0,0,null,0,0]
{"$rows_left_out":34}
{"sheet":"Tailings","index":5,"n_rows":80,"n_cols":11,"rows_kept":80,"cut":false,"hidden":false,"merged":[]}
[1,"Tailings Impoundment Name:",null,null,null,null,"Pond #",1]
[]
[null,"ACTIVITY/MATERIAL","Notes","Units","Quantity","Cost Code","Unit Cost","Cost","% Land","Land Cost","Water Cost"]
[null,"CONTROL ACCESS"]
[null,"Fence",null,"m",null,{"$f":"NA()","v":{"$error":"#N/A"}},{"$f":"IF(ISNA(F5),0,INDEX(IF(UPPER(RIGHT(F5,1))=Low,UnitCostLow, IF(UPPER(RIGHT(F5,1))=High,UnitCostHigh,UnitCostSpecified)),MATCH(UPPER(LEFT(F5,LEN(F5)-1)),CostCode,0)))","v":0},{"$f":"G5*E5","v":0},null,{"$f":"H5*I5","v":0},{"$f":"+H5*(1-I5)","v":0}]
[null,"Signs",null,"each",null,{"$f":"NA()","v":{"$error":"#N/A"}},{"$f":"IF(ISNA(F6),0,INDEX(IF(UPPER(RIGHT(F6,1))=Low,UnitCostLow, IF(UPPER(RIGHT(F6,1))=High,UnitCostHigh,UnitCostSpecified)),MATCH(UPPER(LEFT(F6,LEN(F6)-1)),CostCode,0)))","v":0},{"$f":"G6*E6","v":0},null,{"$f":"H6*I6","v":0},{"$f":"+H6*(1-I6)","v":0}]
[null,"Berm",null,"m3",null,{"$f":"NA()","v":{"$error":"#N/A"}},{"$f":"IF(ISNA(F7),0,INDEX(IF(UPPER(RIGHT(F7,1))=Low,UnitCostLow, IF(UPPER(RIGHT(F7,1))=High,UnitCostHigh,UnitCostSpecified)),MATCH(UPPER(LEFT(F7,LEN(F7)-1)),CostCode,0)))","v":0},{"$f":"G7*E7","v":0},null,0,0]
[null,"Block roads",null,"m3",null,{"$f":"NA()","v":{"$error":"#N/A"}},{"$f":"IF(ISNA(F8),0,INDEX(IF(UPPER(RIGHT(F8,1))=Low,UnitCostLow, IF(UPPER(RIGHT(F8,1))=High,UnitCostHigh,UnitCostSpecified)),MATCH(UPPER(LEFT(F8,LEN(F8)-1)),CostCode,0)))","v":0},{"$f":"G8*E8","v":0},null,0,0]
[null,"Other",null,null,null,{"$f":"NA()","v":{"$error":"#N/A"}},{"$f":"IF(ISNA(F9),0,INDEX(IF(UPPER(RIGHT(F9,1))=Low,UnitCostLow, IF(UPPER(RIGHT(F9,1))=High,UnitCostHigh,UnitCostSpecified)),MATCH(UPPER(LEFT(F9,LEN(F9)-1)),CostCode,0)))","v":0},{"$f":"G9*E9","v":0},null,0,0]
[null,"STABILIZE EMBANKMENT(S)"]
{"$rows_left_out":71}
{"sheet":"Rock Pile","index":6,"n_rows":67,"n_cols":11,"rows_kept":67,"cut":false,"hidden":false,"merged":[]}
[1,"Rock Pile Name:"]
[]
[null,"ACTIVITY/MATERIAL","Notes","Units","Quantity","Cost Code","Unit Cost","Cost","% Land","Land Cost","Water Cost"]
[null,"STABILIZE SLOPES"]
[null,"Flatten slopes with dozer",null,"m3",null,{"$f":"NA()","v":{"$error":"#N/A"}},{"$f":"IF(ISNA(F5),0,INDEX(IF(UPPER(RIGHT(F5,1))=Low,UnitCostLow, IF(UPPER(RIGHT(F5,1))=High,UnitCostHigh,UnitCostSpecified)),MATCH(UPPER(LEFT(F5,LEN(F5)-1)),CostCode,0)))","v":0},{"$f":"G5*E5","v":0},null,{"$f":"H5*I5","v":0},{"$f":"+H5*(1-I5)","v":0}]
[null,"Flatten \"bubble dump\" areas",null,"m3",null,{"$f":"NA()","v":{"$error":"#N/A"}},0,0,null,0,0]
[null,"Divert runon, ditch mat'l A",null,"m3",null,{"$f":"NA()","v":{"$error":"#N/A"}},0,0,null,0,0]
[null,"Divert runon, ditch mat'l B",null,"m3",null,{"$f":"NA()","v":{"$error":"#N/A"}},0,0,null,0,0]
[null,"Toe buttress, drain mat'l",null,"m3",null,{"$f":"NA()","v":{"$error":"#N/A"}},0,0,null,0,0]
[null,"Toe buttress, fill mat'l A",null,"m3",null,{"$f":"NA()","v":{"$error":"#N/A"}},0,0,null,0,0]
{"$rows_left_out":58}
{"sheet":"Chemicals","index":7,"n_rows":52,"n_cols":11,"rows_kept":52,"cut":false,"hidden":false,"merged":[[2,1,2,7]]}
[1,"Chemicals/Soil Area Name:"]
[]
[null,"Note:         The procedures, equipment and packaging for clean up and removal of chemicals or contaminated soils are highly dependent on the nature of the chemicals and their existing state of containment. Government guidelines should be consulted on an individual chemical basis.  Any estimate made here should be considered very rough unless specific evaluations have been conducted."]
[null,"ACTIVITY/MATERIAL","Notes","Units","Quantity","Cost Code","Unit Cost","Cost","% Land","Land Cost","Water Cost"]
[null,"HAZARDOUS MATERIALS AUDIT"]
[null,"Hazardous materials audit",null,"mandays",null,{"$f":"NA()","v":{"$error":"#N/A"}},{"$f":"IF(ISNA(F6),0,INDEX(IF(UPPER(RIGHT(F6,1))=Low,UnitCostLow, IF(UPPER(RIGHT(F6,1))=High,UnitCostHigh,UnitCostSpecified)),MATCH(UPPER(LEFT(F6,LEN(F6)-1)),CostCode,0)))","v":0},{"$f":"G6*E6","v":0},null,{"$f":"H6*I6","v":0},{"$f":"+H6*(1-I6)","v":0}]
[null,"BUILDING DECONTAMINATION & CONSOLIDATION OF HAZARDOUS MATERIALS"]
[null,"Environmental technician/coordinator",null,"mandays",null,{"$f":"NA()","v":{"$error":"#N/A"}},{"$f":"IF(ISNA(F8),0,INDEX(IF(UPPER(RIGHT(F8,1))=Low,UnitCostLow, IF(UPPER(RIGHT(F8,1))=High,UnitCostHigh,UnitCostSpecified)),MATCH(UPPER(LEFT(F8,LEN(F8)-1)),CostCode,0)))","v":0},{"$f":"G8*E8","v":0},null,{"$f":"H8*I8","v":0},{"$f":"+H8*(1-I8)","v":0}]
[null,"Decontaminate: oil, fuel",null,"mandays",null,{"$f":"NA()","v":{"$error":"#N/A"}},{"$f":"IF(ISNA(F9),0,INDEX(IF(UPPER(RIGHT(F9,1))=Low,UnitCostLow, IF(UPPER(RIGHT(F9,1))=High,UnitCostHigh,UnitCostSpecified)),MATCH(UPPER(LEFT(F9,LEN(F9)-1)),CostCode,0)))","v":0},0,null,0,0]
[null,"Decontaminate maintenance shop",null,"mandays",null,{"$f":"NA()","v":{"$error":"#N/A"}},{"$f":"IF(ISNA(F10),0,INDEX(IF(UPPER(RIGHT(F10,1))=Low,UnitCostLow, IF(UPPER(RIGHT(F10,1))=High,UnitCostHigh,UnitCostSpecified)),MATCH(UPPER(LEFT(F10,LEN(F10)-1)),CostCode,0)))","v":0},0,null,0,0]
{"$rows_left_out":43}
{"sheet":"Bldgs & Equip","index":8,"n_rows":60,"n_cols":11,"rows_kept":60,"cut":false,"hidden":false,"merged":[]}
[1,"Building / Equip Name:",null,null,null,null,"Bldg / Equip #:",1]
[]
[null,"ACTIVITY/MATERIAL","Notes","Units","Quantity","Cost Code","Unit Cost","Cost","% Land","Land Cost","Water Cost"]
[null,"DISPOSE MOBILE EQUIPMENT"]
[null,"Decontaminate and ship off-site",null,"allow",null,{"$f":"NA()","v":{"$error":"#N/A"}},{"$f":"IF(ISNA(F5),0,INDEX(IF(UPPER(RIGHT(F5,1))=Low,UnitCostLow, IF(UPPER(RIGHT(F5,1))=High,UnitCostHigh,UnitCostSpecified)),MATCH(UPPER(LEFT(F5,LEN(F5)-1)),CostCode,0)))","v":0},{"$f":"G5*E5","v":0},null,{"$f":"H5*I5","v":0},{"$f":"+H5*(1-I5)","v":0}]
[null,"Decontaminate and dispose on-site",null,"allow",null,{"$f":"NA()","v":{"$error":"#N/A"}},{"$f":"IF(ISNA(F6),0,INDEX(IF(UPPER(RIGHT(F6,1))=Low,UnitCostLow, IF(UPPER(RIGHT(F6,1))=High,UnitCostHigh,UnitCostSpecified)),MATCH(UPPER(LEFT(F6,LEN(F6)-1)),CostCode,0)))","v":0},{"$f":"G6*E6","v":0},null,{"$f":"H6*I6","v":0},{"$f":"+H6*(1-I6)","v":0}]
[null,"Other",null,null,null,{"$f":"NA()","v":{"$error":"#N/A"}},{"$f":"IF(ISNA(F7),0,INDEX(IF(UPPER(RIGHT(F7,1))=Low,UnitCostLow, IF(UPPER(RIGHT(F7,1))=High,UnitCostHigh,UnitCostSpecified)),MATCH(UPPER(LEFT(F7,LEN(F7)-1)),CostCode,0)))","v":0},{"$f":"G7*E7","v":0},null,0,0]
[null,"REMOVE BUILDINGS - see note below"]
[null,"Accomodation Complex",null,"m2",null,{"$f":"NA()","v":{"$error":"#N/A"}},{"$f":"IF(ISNA(F9),0,INDEX(IF(UPPER(RIGHT(F9,1))=Low,UnitCostLow, IF(UPPER(RIGHT(F9,1))=High,UnitCostHigh,UnitCostSpecified)),MATCH(UPPER(LEFT(F9,LEN(F9)-1)),CostCode,0)))","v":0},{"$f":"G9*E9","v":0},null,0,0]
[null,"Process Facilities",null,"m2",null,{"$f":"NA()","v":{"$error":"#N/A"}},0,0,null,0,0]
{"$rows_left_out":51}
{"sheet":"Water Management","index":9,"n_rows":58,"n_cols":8,"rows_kept":58,"cut":false,"hidden":false,"merged":[]}
[1,"Capital Expenditures and Short Term Water Treatment identified in 'Instructions' worksheet"]
[]
[null,"ACTIVITY/MATERIAL","Notes","Units","Quantity","Cost Code","Unit Cost","Cost"]
[null,"BREACH DYKE EMBANKMENT"]
[null,"Remove fill",null,"m3",null,{"$f":"NA()","v":{"$error":"#N/A"}},{"$f":"IF(ISNA(F5),0,INDEX(IF(UPPER(RIGHT(F5,1))=Low,UnitCostLow, IF(UPPER(RIGHT(F5,1))=High,UnitCostHigh,UnitCostSpecified)),MATCH(UPPER(LEFT(F5,LEN(F5)-1)),CostCode,0)))","v":0},{"$f":"G5*E5","v":0}]
[null,"Contour water intake area",null,"m3",null,{"$f":"NA()","v":{"$error":"#N/A"}},{"$f":"IF(ISNA(F6),0,INDEX(IF(UPPER(RIGHT(F6,1))=Low,UnitCostLow, IF(UPPER(RIGHT(F6,1))=High,UnitCostHigh,UnitCostSpecified)),MATCH(UPPER(LEFT(F6,LEN(F6)-1)),CostCode,0)))","v":0},{"$f":"G6*E6","v":0}]
[null,"STABILIZE SEDIMENT PONDS/WATER MANAGEMENT PONDS"]
[null,"Place soil cover",null,"m3",null,{"$f":"NA()","v":{"$error":"#N/A"}},{"$f":"IF(ISNA(F8),0,INDEX(IF(UPPER(RIGHT(F8,1))=Low,UnitCostLow, IF(UPPER(RIGHT(F8,1))=High,UnitCostHigh,UnitCostSpecified)),MATCH(UPPER(LEFT(F8,LEN(F8)-1)),CostCode,0)))","v":0},{"$f":"G8*E8","v":0}]
[null,"Doze & spread excavated material",null,"m3",null,{"$f":"NA()","v":{"$error":"#N/A"}},{"$f":"IF(ISNA(F9),0,INDEX(IF(UPPER(RIGHT(F9,1))=Low,UnitCostLow, IF(UPPER(RIGHT(F9,1))=High,UnitCostHigh,UnitCostSpecified)),MATCH(UPPER(LEFT(F9,LEN(F9)-1)),CostCode,0)))","v":0},{"$f":"G9*E9","v":0}]
[null,"Vegetate spread material",null,"ha",null,{"$f":"NA()","v":{"$error":"#N/A"}},{"$f":"IF(ISNA(F10),0,INDEX(IF(UPPER(RIGHT(F10,1))=Low,UnitCostLow, IF(UPPER(RIGHT(F10,1))=High,UnitCostHigh,UnitCostSpecified)),MATCH(UPPER(LEFT(F10,LEN(F10)-1)),CostCode,0)))","v":0},{"$f":"G10*E10","v":0}]
{"$rows_left_out":49}
{"sheet":"Water Treatment","index":10,"n_rows":36,"n_cols":8,"rows_kept":36,"cut":false,"hidden":false,"merged":[]}
[1,"Water Treatment"]
[]
[null,"ACTIVITY/MATERIAL","Notes","Units","Quantity","Cost Code","Unit Cost","Cost"]
[null,"ADDITION OF REAGENTS"]
[null,"H2O2",null,"kg",null,{"$f":"NA()","v":{"$error":"#N/A"}},{"$f":"IF(ISNA(F5),0,INDEX(IF(UPPER(RIGHT(F5,1))=Low,UnitCostLow, IF(UPPER(RIGHT(F5,1))=High,UnitCostHigh,UnitCostSpecified)),MATCH(UPPER(LEFT(F5,LEN(F5)-1)),CostCode,0)))","v":0},{"$f":"G5*E5","v":0}]
[null,"lime",null,"kg",null,{"$f":"NA()","v":{"$error":"#N/A"}},0,0]
[null,"ferric sulphate",null,"kg",null,{"$f":"NA()","v":{"$error":"#N/A"}},0,0]
[null,"ferrous sulphate",null,"kg",null,{"$f":"NA()","v":{"$error":"#N/A"}},0,0]
[null,"flocculents",null,"kg",null,{"$f":"NA()","v":{"$error":"#N/A"}},0,0]
[null,"Other",null,null,null,{"$f":"NA()","v":{"$error":"#N/A"}},0,0]
{"$rows_left_out":27}
{"sheet":"PostClosure","index":11,"n_rows":36,"n_cols":8,"rows_kept":36,"cut":false,"hidden":false,"merged":[]}
[1,"Post-Closure Monitoring &  Maintenance:"]
[]
[null,"ACTIVITY/MATERIAL","Notes","Units","Quantity","Cost Code","Unit Cost","Cost"]
[null,"MONITORING & INSPECTIONS"]
[null,"Annual geotechnical inspection",null,"each",null,{"$f":"NA()","v":{"$error":"#N/A"}},{"$f":"IF(ISNA(F5),0,INDEX(IF(UPPER(RIGHT(F5,1))=Low,UnitCostLow, IF(UPPER(RIGHT(F5,1))=High,UnitCostHigh,UnitCostSpecified)),MATCH(UPPER(LEFT(F5,LEN(F5)-1)),CostCode,0)))","v":0},{"$f":"G5*E5","v":0}]
[null,"Survey inspection",null,"each",null,{"$f":"NA()","v":{"$error":"#N/A"}},0,0]
[null,"Regulatory costs*",null,"each",null,{"$f":"NA()","v":{"$error":"#N/A"}},0,{"$f":"G7*E7","v":0}]
[null,"Site water monitoring (AEMP and SNP)",null,"each",null,{"$f":"NA()","v":{"$error":"#N/A"}},{"$f":"IF(ISNA(F8),0,INDEX(IF(UPPER(RIGHT(F8,1))=Low,UnitCostLow, IF(UPPER(RIGHT(F8,1))=High,UnitCostHigh,UnitCostSpecified)),MATCH(UPPER(LEFT(F8,LEN(F8)-1)),CostCode,0)))","v":0},0]
[null,"   - Active closure and flooding",null,"each",null,{"$f":"NA()","v":{"$error":"#N/A"}},0,0]
[null,"   - Post pit flooding",null,"each",null,{"$f":"NA()","v":{"$error":"#N/A"}},0,0]
{"$rows_left_out":27}
{"sheet":"ICM","index":12,"n_rows":21,"n_cols":8,"rows_kept":21,"cut":false,"hidden":false,"merged":[]}
[1,"Interim Care and Maintenance"]
[]
[null,"ACTIVITY/MATERIAL","Notes","Units","Quantity","Cost Code","Unit Cost","Cost"]
[null,"INTERIM CARE & MAINTENANCE"]
[null,"on-site caretaker",null,"manmonths",null,{"$f":"NA()","v":{"$error":"#N/A"}},{"$f":"IF(ISNA(F5),0,INDEX(IF(UPPER(RIGHT(F5,1))=Low,UnitCostLow, IF(UPPER(RIGHT(F5,1))=High,UnitCostHigh,UnitCostSpecified)),MATCH(UPPER(LEFT(F5,LEN(F5)-1)),CostCode,0)))","v":0},{"$f":"G5*E5","v":0}]
[null,"extra personnel",null,"manmonths",null,{"$f":"NA()","v":{"$error":"#N/A"}},0,0]
[null,"    -electrician",null,"manmonths",null,{"$f":"NA()","v":{"$error":"#N/A"}},{"$f":"IF(ISNA(F7),0,INDEX(IF(UPPER(RIGHT(F7,1))=Low,UnitCostLow, IF(UPPER(RIGHT(F7,1))=High,UnitCostHigh,UnitCostSpecified)),MATCH(UPPER(LEFT(F7,LEN(F7)-1)),CostCode,0)))","v":0},{"$f":"G7*E7","v":0}]
[null,"    -mechanic",null,"manmonths",null,{"$f":"NA()","v":{"$error":"#N/A"}},{"$f":"IF(ISNA(F8),0,INDEX(IF(UPPER(RIGHT(F8,1))=Low,UnitCostLow, IF(UPPER(RIGHT(F8,1))=High,UnitCostHigh,UnitCostSpecified)),MATCH(UPPER(LEFT(F8,LEN(F8)-1)),CostCode,0)))","v":0},{"$f":"G8*E8","v":0}]
[null,"annual fuel",null,"litre",null,{"$f":"NA()","v":{"$error":"#N/A"}},0,0]
[null,"misc. supplies",null,"allow",null,{"$f":"NA()","v":{"$error":"#N/A"}},{"$f":"IF(ISNA(F10),0,INDEX(IF(UPPER(RIGHT(F10,1))=Low,UnitCostLow, IF(UPPER(RIGHT(F10,1))=High,UnitCostHigh,UnitCostSpecified)),MATCH(UPPER(LEFT(F10,LEN(F10)-1)),CostCode,0)))","v":0},{"$f":"G10*E10","v":0}]
{"$rows_left_out":12}
{"sheet":"Mobilization","index":13,"n_rows":58,"n_cols":8,"rows_kept":58,"cut":false,"hidden":false,"merged":[]}
[1,"Mobilization/Demobilization:"]
[]
[null,"ACTIVITY/MATERIAL","Notes","Units","Quantity","Cost Code","Unit Cost","Cost"]
[null,"MOBILIZE HEAVY EQUIPMENT"]
[null,"Excavators",null,"each",null,{"$f":"NA()","v":{"$error":"#N/A"}},{"$f":"IF(ISNA(F5),0,INDEX(IF(UPPER(RIGHT(F5,1))=Low,UnitCostLow, IF(UPPER(RIGHT(F5,1))=High,UnitCostHigh,UnitCostSpecified)),MATCH(UPPER(LEFT(F5,LEN(F5)-1)),CostCode,0)))","v":0},{"$f":"G5*E5","v":0}]
[null,"Dump trucks",null,"each",null,{"$f":"NA()","v":{"$error":"#N/A"}},0,0]
[null,"Dozers",null,"each",null,{"$f":"NA()","v":{"$error":"#N/A"}},0,0]
[null,"Demolition shears",null,"each",null,{"$f":"NA()","v":{"$error":"#N/A"}},0,0]
[null,"Crane",null,"each",null,{"$f":"NA()","v":{"$error":"#N/A"}},0,0]
[null,"Loader",null,"each",null,{"$f":"NA()","v":{"$error":"#N/A"}},0,{"$f":"G10*E10","v":0}]
{"$rows_left_out":49}
{"sheet":"Unit_Costs","index":14,"n_rows":172,"n_cols":12,"rows_kept":172,"cut":false,"hidden":false,"merged":[]}
["Unit Cost Table (for refining unit costs see \"Estimator\" worksheet)"]
[null,null,null,"Filter by unit",null,"",""]
[null,null,null,null,null,"","",""]
["ITEM","Detail",null,"COST CODE","UNITS","LOW $","HIGH $","SPECIFIED $",null,"COMMENTS"]
[null,null,null,null,null,"","",""]
["Accomodation"]
[null,null,null,"ACCM","manday",100,175]
["Buildings - Decontaminate",null,null,null,null,"","",""]
[null,"Asbestos",null,"BDA","m2",25.6,51.2,null,null,"Low: removal of asbestos siding & flooring; High: removal of insulated pipes, friable asbestos"]
["Buildings - Remove",null,null,null,null,"","","",null,"Unit costs are based on 3m high, single storey building.  Scale areas accordingly."]
{"$rows_left_out":163}
{"sheet":"Estimator","index":15,"n_rows":55,"n_cols":15,"rows_kept":55,"cut":false,"hidden":false,"merged":[]}
[null,"Unit Cost Estimator",null,1,"Equipment Productivity Figures and Graphs have been reproduced from Caterpillar Performance Handbook - Edition 42 "]
[null,"EXCAVATION",null,null,null,null,"HAUL AND DUMPING",null,null,null,null,"SPREADING/DOZING"]
[null,"Productivity",null,null,null,null,"Productivity",null,null,null,null,"Productivity"]
[null,"Machine","Cat 336EL",null,null,null,"Machine","Cat 770",null,null,null,"Machine","Cat D8"]
[null,"bucket capacity",null,3.16,"m3",null,"truck capacity",null,25.1,"m3",null,"Estimate production using example curves provided or ",null,600,"m3/hr"]
[null,"fill factor",null,0.75,"%",null,"fill factor",null,0.8,"%",null,"equivalent from other supplier"]
[null,"cycle time",null,45,"seconds",null,null,null,null,null,null,"Correction factors (see table provided)"]
[null,"operator skill",null,0.8,"%",null,"load time",null,6,"min.",null,"      operator skill",null,0.75]
[null,"machine availability",null,0.83,"%",null,"haul distance",null,1.5,"km",null,"      material type, see table",null,0.8]
[null,"altitude adjustment",null,1,"%",null,"average velocity",null,20,"km/hr",null,"      slot dozing",null,1]
{"$rows_left_out":45}